{"text_format":"2","workbook":"xlsx","n_sheets":2,"sheets":["0. 기본정보입력(필수)","1. 과제 계획서"],"not_rendered":{"charts":0,"images":0,"macros":0,"external_links":0,"defined_names":2,"comments":2,"pivot_tables":0},"unopened":[],"bounds":{"document_bytes":16777216,"sheet_cells":100000,"run_cost":"one","rows_first":2000,"rows_last":500,"rows_between":2000,"halvings":0,"cell_chars":16384,"cell_head_chars":4096},"cells_cut":0,"cells_raw":0,"read":"whole","date_system":"1900"}

{"sheet":"0. 기본정보입력(필수)","index":0,"n_rows":12,"n_cols":8,"rows_kept":12,"cut":false,"hidden":false,"merged":[[5,0,5,7],[0,0,0,7],[3,0,3,7],[1,0,1,7],[11,0,11,7]]}
["[서식0] 기본정보입력(필수)"]
[]
[]
["2023학년도 2학기"]
[]
[{"$f":"\"[혁신-\" & VLOOKUP(A10,$A$9:$H$10,3,0) & \"]\" & VLOOKUP(A10,$A$9:$H$10,4,0) & \"-\" & VLOOKUP(A10,$A$9:$H$10,5,0) & \"분반\"","v":"[혁신-건설시스템공학과]건설융합특론(캡스톤디자인)-4분반"}]
[]
[null,"단과대학","주관학과","교과목명","분반","수강인원","담당교수","유형"]
["예시","인문사회과학대학","게임애니메이션AI융합전공","인공지능융합캡스톤디자인",10,20,"규현초이, 김정환","지역사회연계프로젝트"]
["작성","공과대학","건설시스템공학과","건설융합특론(캡스톤디자인)",4,19,"박종섭, 안병렬","문제해결프로젝트"]
[]
["※ 변경 불가능한 셀은 자동입력 되는 곳입니다. 필요 시, 암호 6470 을 입력하여 시트보호를 해제하고 사용하여 주십시오."]

{"sheet":"1. 과제 계획서","index":1,"n_rows":137,"n_cols":10,"rows_kept":137,"cut":false,"hidden":false,"merged":[[67,1,67,2],[36,1,36,2],[35,1,35,2],[32,1,32,2],[31,1,31,2],[28,1,28,2],[37,1,37,2],[38,1,38,2],[39,1,39,2],[46,1,46,2],[51,1,51,2],[50,1,50,2],[49,1,49,2],[48,1,48,2],[47,1,47,2],[30,1,30,2],[33,1,33,2],[137,0,137,9],[132,0,134,9],[135,0,135,9],[136,0,136,8],[130,1,130,8],[131,1,131,8],[106,2,111,9],[126,1,126,8],[127,1,127,8],[128,1,128,8],[129,1,129,8],[120,1,120,8],[121,1,121,8],[122,1,122,8],[123,1,123,8],[124,1,124,8],[24,0,25,9],[69,0,69,9],[70,0,71,9],[72,0,72,9],[73,0,92,9],[93,0,93,9],[94,2,99,9],[100,2,105,9],[34,1,34,2],[29,1,29,2],[62,1,62,2],[61,1,61,2],[60,1,60,2],[59,1,59,2],[56,1,56,2],[55,1,55,2],[54,1,54,2],[53,1,53,2],[52,1,52,2],[58,1,58,2],[26,0,27,0],[26,8,27,8],[26,9,27,9],[26,1,27,2],[0,0,0,9],[1,0,1,9],[2,0,2,9],[3,0,3,9],[4,2,4,5],[4,7,4,9],[18,2,23,9],[5,2,5,5],[5,7,5,9],[6,2,6,5],[6,7,6,9],[7,2,7,5],[7,7,7,9],[8,2,8,5],[8,7,8,9],[9,0,10,9],[11,2,17,9],[11,0,17,1],[18,0,23,1],[4,0,4,1],[5,0,5,1],[6,0,6,1],[7,0,7,1],[8,0,8,1],[26,3,27,3],[26,4,27,4],[26,5,27,5],[26,6,27,6],[26,7,27,7],[125,1,125,8],[112,0,117,1],[106,0,111,1],[100,0,105,1],[94,0,99,1],[65,1,65,2],[66,1,66,2],[63,1,63,2],[64,1,64,2],[40,1,40,2],[41,1,41,2],[42,1,42,2],[43,1,43,2],[44,1,44,2],[112,2,117,9],[118,0,119,9],[57,1,57,2],[45,1,45,2],[68,0,68,9]]}
["[서식1]"]
[]
["[서식1] 2-1 page"]
["캡스톤디자인 과제 계획서"]
["학년도",null,{"$f":"LEFT('0. 기본정보입력(필수)'!A4,4)","v":"2023"},null,null,null,"학기",{"$f":"MID('0. 기본정보입력(필수)'!A4,9,1)","v":"2"}]
["단과대학",null,{"$f":"VLOOKUP('0. 기본정보입력(필수)'!A10,'0. 기본정보입력(필수)'!A10:H10,2,0)","v":"공과대학"},null,null,null,"주관학과",{"$f":"VLOOKUP('0. 기본정보입력(필수)'!A10,'0. 기본정보입력(필수)'!A10:H10,3,0)","v":"건설시스템공학과"}]
["교과목명",null,{"$f":"VLOOKUP('0. 기본정보입력(필수)'!A10,'0. 기본정보입력(필수)'!A10:H10,4,0)","v":"건설융합특론(캡스톤디자인)"},null,null,null,"분반",{"$f":"VLOOKUP('0. 기본정보입력(필수)'!A10,'0. 기본정보입력(필수)'!A10:H10,5,0)","v":4}]
["담당교수",null,{"$f":"VLOOKUP('0. 기본정보입력(필수)'!A10,'0. 기본정보입력(필수)'!A10:H10,7,0)","v":"박종섭, 안병렬"},null,null,null,"유형",{"$f":"VLOOKUP('0. 기본정보입력(필수)'!A10,'0. 기본정보입력(필수)'!A10:H10,8,0)","v":"문제해결프로젝트"}]
["수강인원",null,{"$f":"VLOOKUP('0. 기본정보입력(필수)'!A10,'0. 기본정보입력(필수)'!A10:H10,6,0)","v":19},null,null,null,"팀 구성",{"$f":"IF(MOD(COUNTA(B29:H68),2)=0,IF(COUNTA(B29:D68)<COUNTA(E29:H68),IF(COUNTA(B29:C68)=COUNTA(D29:D68),IF(COUNTA(E29:H68)/2=COUNTA(B29:D68),COUNTIF(D29:D68,\"팀장\")&\"팀 / \"&COUNTA(D29:D68)&\"명\",IF(COUNTA(E29:H68)/4=COUNTA(G29:G68),COUNTIF(D29:D68,\"팀장\")&\"팀 / \"&COUNTA(D29:D68)&\"명 외 개인 \"&COUNTA(E29:H68)/4-COUNTA(D29:D68)&\"명\",\"입력오류\")),\"입력오류\"),\"입력오류\"),\"입력오류\")","v":"4팀 / 17명"}]
["1단계: 팀 구성 및 서약"]
[]
["개인정보 \n수집 및 \n이용 동의",null,"1. 개인정보 수집ㆍ이용 목적: 교육혁신추진팀은 캡스톤디자인 교과목 운영을 목적으로 학생의 개인정보를 수집하고자 하며, \n수집된 개인정보는 교과목 운영을 위한 목적으로만 이용됩니다. \n2. 수집하려는 개인정보의 항목: 캡스톤디자인 참가자의 소속, 학번, 성명, 연락처, 계좌정보\n3. 개인정보 보유 및 이용 기간은 5년이며, 수집된 개인정보는 보유 및 이용 기간 경과 시 파기됩니다. \n4. 동의를 거부할 권리 및 동의 거부에 따른 불이익: 개인정보 수집 및 이용에 대하여 동의를 거부할 수 있으나, \n거부할 시 캡스톤디자인 참가 신청이 완료되지 않음을 유의하시기 바랍니다."]
[]
[]
[]
[]
[]
[]
["작성 전 \n확인 및 서약",null,"1. 작성자는 캡스톤디자인 교과목 지원 가이드라인을 확인하고 숙지하였으며, 가이드라인 미숙지로 인한 책임은 본인에게 있고 가이드라인 \n내용을 반드시 확인하고 캡스톤디자인 교과목을 성실히 수행할 것을 약속합니다.\n2. 모든 캡스톤디자인 과제 수행 팀은 각종 서류 구비, 제출 기한 등에 충실히 응해야 하며, 담당교수 및 산업체/지역사회 멘토의 지도를 받아 성실하게 과제를 수행할 것을 약속합니다. \n3. 팀장/팀원별 역할에 협력적 태도로 임할 것을 서약합니다."]
[]
[]
[]
[]
[]
["위 내용에 대한 동의 및 팀 구성 확인"]
[]
["순번","팀명",null,"팀장/\n팀원","학생 소속학과","학년","학번","성명","개인정보 동의 여부","자필 서명"]
[]
[1,"1조",null,"팀장","건설시스템공학과",4,"201821191","김동현"]
[2,"1조",null,"팀원","건설시스템공학과",4,"201821193","김민섭"]
[3,"1조",null,"팀원","건설시스템공학과",4,"201821195","김민철"]
[4,"1조",null,"팀원","건설시스템공학과",4,"201821199","김승회"]
[5,"2조",null,"팀원","환경조경학과",4,"201920743","김예원"]
[6,"2조",null,"팀원","건설시스템공학과",4,"201821200","김윤구"]
[7,"2조",null,"팀원","건설시스템공학과",4,"201821201","김정민"]
[8,"2조",null,"팀장","건설시스템공학과",4,"202021217","문지우"]
[9,"3조",null,"팀장","건설시스템공학과",4,"201821208","손상록"]
[10,"3조",null,"팀원","건설시스템공학과",4,"202021223","안수빈"]
[11,"3조",null,"팀원","건설시스템공학과",4,"202021228","이동건"]
[12,"3조",null,"팀원","건설시스템공학과",4,"201921211","이소정"]
[13,"3조",null,"팀원","건설시스템공학과",4,"201821218","장경진"]
[14,"4조",null,"팀장","건설시스템공학과",4,"201521369","전성현"]
[15,"4조",null,"팀원","건설시스템공학과",4,"201821222","최정환"]
[16,"4조",null,"팀원","건설시스템공학과",4,"201921226","탁현수"]
[17,"4조",null,"팀원","건설시스템공학과",4,"202021237","허정윤"]
[18]
[19]
[20]
[21]
[22]
[23]
[24]
[25]
[26]
[27]
[28]
[29]
[30]
[31]
[32]
[33]
[34]
[35]
[36]
[37]
[38]
[39]
[40]
[]
["[서식1] 2-2 page"]
["2단계: 과제 세부 계획"]
[]
["1. 과제의 목표 및 결과물 개발 시 기대효과"]
["1조. 스마트 건설을 위한 인프라 시설물의 파라메트릭 모델링 기법 제안\n- 스마트 건설 모델링 구축 및 학습\n- 최종 성과물 도출 및 발표\n2조. 인프라 시설물의 3차원 설계 , 시공, 유지관리 단계에서 활용하고 있는 4차 산업혁명 기술 조사 및 사례 발표\n- 전 생애주기(설계, 시공, 유지관리단계)에서 활용되고 있는 4차 산업혁명 기술 조사\n- 현재 활용 및 개발되는 사례 정리 및 발표\n3조: 상하수도 수질 개선을 위한 친환경 기술 개발\n- 물리·화학·생물학적 방법을 통한 상하수도의 유·무기물질 제거 방법 제시\n- 기후변화대비와 탄소저감이 가능한 친환경 기술(공법) 결정\n- 수질 개선과 이산화탄소 저감이 동시에 가능한 기술 이용을 통해 급격한 기후변화에 대응 효과  \n4조: 수처리 공정별 최적 운전 조건 결정인자 평가\n- 각 공정별 최적의 물리·화학·생물학적 수처리 방법 결정\n- 선정된 공정의 최적인자(초기 유입농도, 반응시간, 체류시간, 화학적 특징)별 최적 제거효율 결정 및 평가\n- 효과적인 제거효율을 통해 각공정의 최적 운전시간, 시설부지, 운영인력 결정을 통한 운영비용 절감 효과"]
{"$rows_empty":19}
["."]
["1~4주차",null,"캡스톤디자인 계획서 작성/ 자료 및 문헌 조사/ 디자인 목적, 방법, 절차, 성과도출 방안 협의\n건설시스템공학과 졸업생 전문가의 특강과 자문을 통한 캡스톤디자인 방향설정"]
[]
[]
[]
[]
[]
["5~8주차",null,"조원별 담당주제 개별발표 및 토의/ 조별 결과물 도출 상세 추진 검토/ 중간발표\n건설시스템공학과 졸업생 전문가의 특강과 자문을 통한 캡스톤디자인 결과물 도출방안 모색"]
[]
[]
[]
[]
[]
["9~12주차",null,"수정보완을 통한 캡스톤디자인 성과물 구체화/ 추가적인 자료조사 및 문헌 조사\n건설시스템공학과 졸업생 전문가의 특강과 자문을 통한 캡스톤디자인 수정보완"]
[]
[]
[]
[]
[]
["13~15주차",null,"최종성과물 도출/ 기말 최종 성과물 발표 및 평가\n건설시스템공학과 졸업생 전문가의 특강과 자문을 통한 캡스톤디자인 최종평가"]
[]
[]
[]
[]
[]
[{"$f":"\"3단계: 지원금 신청 (신청 가능 금액: \"&TEXT(COUNTA(D29:D68)*IF(H8=\"문제해결프로젝트\",100000,150000),\"#,###\")&\"원)\"","v":"3단계: 지원금 신청 (신청 가능 금액: 1,700,000원)"}]
[]
["순번","신청 내용",{"$nulls":7},"신청 금액(원)"]
[1,"특강 300,000원 * 4회",{"$nulls":7},1200000]
[2,"(대한토목) 학회 등록 100,000원*3명(팀 대표 1명씩)",{"$nulls":7},300000]
[3,"기타 인쇄, 복사, 제본, 포스터 제작 ",{"$nulls":7},200000]
[4]
[5]
[6]
[7]
[8]
[9]
[10]
[null,"신청 금액 합계",{"$nulls":7},{"$f":"IF(SUM(J122:J131)<=COUNTA(D29:D68)*IF(H8=\"문제해결프로젝트\",100000,150000),SUM(J122:J131),\"신청 가능 금액 초과\")","v":1700000}]
["본 교과목의 과제 계획서에 따라 위와 같이 지원금을 신청하며, 중도포기 하거나 구입 불가능 품목을 구입하여 한국연구재단 지적 및 환수 시에는 \n제반 규정에 따라 지급받은 지원금을 지원금 사용자가 반납할 것을 서약합니다."]
[]
[]
[20230904]
["담당 교수:    ",{"$nulls":8},{"$f":"VLOOKUP('0. 기본정보입력(필수)'!A10,'0. 기본정보입력(필수)'!A10:H10,7,0) & \" (인)\"","v":"박종섭, 안병렬 (인)"}]